{"text_format":"1","workbook":"xlsx","n_sheets":3,"sheets":["Planner","Info-Tabellen","Origineel recept"],"not_rendered":{"charts":0,"images":0,"macros":1,"external_links":0,"defined_names":150,"comments":2,"pivot_tables":0},"unopened":[],"bounds":{"document_bytes":16777216,"sheet_cells":100000,"rows_first":2000,"rows_last":500,"rows_between":2000,"halvings":0,"cell_chars":16384,"cell_head_chars":4096},"cells_cut":0,"cells_raw":0,"read":"whole","date_system":"1900"}

{"sheet":"Planner","index":0,"n_rows":90,"n_cols":31,"rows_kept":90,"cut":false,"hidden":false,"merged":[[44,5,44,6],[43,9,43,11],[72,1,72,11],[33,6,33,8],[34,6,34,8],[35,6,35,8],[36,6,36,8],[49,7,49,9],[52,10,52,11],[42,3,42,4],[53,1,53,2],[46,4,46,5],[46,6,46,7],[47,10,47,11],[55,4,55,5],[39,6,39,8],[42,26,42,27],[40,6,40,8],[30,6,30,8],[37,26,37,27],[38,26,38,27],[36,26,36,27],[31,6,31,8],[34,26,34,27],[35,26,35,27],[30,26,31,27],[0,0,0,1],[1,0,1,1],[14,26,15,27],[18,26,19,27],[0,10,0,11],[1,10,1,11],[2,6,2,11],[2,3,2,5],[7,9,7,11],[1,26,2,27],[4,26,5,27],[8,9,8,11],[16,9,16,11],[57,4,57,5],[57,6,57,7],[27,4,27,5],[10,26,11,27],[18,34,18,35],[22,26,23,27],[26,26,27,27],[33,26,33,27],[37,6,37,8],[38,6,38,8],[39,26,39,27],[41,6,41,8],[42,6,42,8],[40,26,40,27],[41,26,41,27],[29,6,29,11]]}
["Recept 53",null," < Naam Bier",null,null,"Beslagdikte in L/kg >  ",4,{"$f":"IF(mashfactor>4.5,0,(5-mashfactor)/2.2)","v":0.45454545454545453},null,"Brouwdatum >","2015-09-02",null,null,null,null,null,null,null,"EBC","R","G","B","A",null,"EBC",null,"Info over de gekozen gist:     Naam >",{"$f":"HoofdGist","v":"Danstar Belle Saison"}]
["Saison",null,"< Type bier",null,null,"\"Extract Efficiëntie\" >",0.77,null,null,"Botteldatum  >","2015-09-12",null,null,null,null,null,null,null,0,255,255,255,0,null,{"$f":"$F$26","v":10.621964030407423},null,{"$f":"G3","v":"Belgische Saisongist"}]
["Gewenste liters bier >",10,"Gist >>","Danstar Belle Saison",null,null,{"$f":"VLOOKUP(HoofdGist,'Info-Tabellen'!$X:$AC,5,0)","v":"Belgische Saisongist"},null,null,null,null,null,null,null,null,null,null,null,1,247,249,180,45]
["Vast verlies installatie >",1,null,null,null," ketelinvloed (vaste parameter) > ",99.5,null,null,"Totale kooktijd >",90,{"$f":"IF(Aardbier=\"D\",-0.5,IF(Aardbier=\"M\",-0.3,IF(Aardbier=1,-0.8,2.5)))","v":-0.5},null,null,null,null,null,null,2,245,248,146,61,null,"R",null,"Info over de bottelgist:          Naam >",{"$f":"K53","v":0}]
["Kies een Maischprofiel >","D",null,"eiwitrust J/N ? >","N",null,"% verkoken/uur>",10,{"$f":"VLOOKUP(HoofdGist,'Info-Tabellen'!$X:$AB,2,0)","v":91},{"$f":"SUM($D$8:$D$18)","v":2.4082857142857144},{"$f":"IF(Eiwitrust=\"J\",10,0)","v":0},{"$f":"(totplato-VSPrestextract)/(2.0665-0.010665*(totplato))","v":5.9650297078611878},null,null,null,null,null,null,3,248,249,114,75,null,{"$f":"LOOKUP($Y$2,$S$2:$S$48,T2:T48)","v":224},null,{"$f":"VLOOKUP(bottelgist,'Info-Tabellen'!$X:$AB,5,0)","v":{"$error":"#N/A"}}]
["Geef opslagtemperatuur mout > ",20,null,null,null,"na beslagcorrectie op Extract Effic.>",{"$f":"IF(mashfactor<3.66,$G$2-((mashfactor)/1000)+0.00666,$G$2-((mashfactor)/20)+0.175)","v":0.74500000000000011},null,{"$f":"IF(moutkilos=0,\"\",IF(Aardbier=1,moutkilos*1.6*($B$30-mouttemp)/(mashwater*4.18),moutkilos*1.6*($B$29-mouttemp)/(mashwater*4.18)))","v":3.9403321137067273},null,"â te verwachten na koken â",null,null,null,{"$f":"VLOOKUP(HoofdGist,'Info-Tabellen'!$X:$AB,3,0)","v":107.5},"ter info",null,null,4,248,247,83,90,null,null,null,null,null,null,null,123456789]
["Grondstoffen","Opbrengst","EBC-kleur","kg â","°PLATO","EBC","%Gew.","%Stort","FG",{"$f":"SUM($E$8:$E$18)","v":12.713763315123025},{"$f":"(1+($J$7/(258.6-0.87955*$J$7)))*1000","v":1051.3858465532819},{"$f":"IF(ISNUMBER($J$7),$J$7*1.035,\"\")","v":13.15874503115233},null,"gist factor","SVG","LoviBond","EBC",null,5,245,248,48,121,null,"G"]
["Pilsmout 3",{"$f":"VLOOKUP(A8,'Info-Tabellen'!$H:$K,2,0)","v":80.069999999999993},{"$f":"VLOOKUP(A8,'Info-Tabellen'!$H:$K,3,0)","v":3},{"$f":"3.97/21*Gewenste_liters*112%","v":2.1173333333333333},{"$f":"IF(Gewenste_liters=0,\"0\",IF(D8=0,\"  \",(B8*D8/(Gewenste_liters+hopverlies))*effic))","v":11.232681987041037},{"$f":"IF(Gewenste_liters=0,\"0\",IF(D8=0,\"  \",1.8*(Q8)^0.69))","v":5.2610032610823989},{"$f":"IF(D8=\"\",\"  \",(D8*100/Totaalkg))","v":79.879275653923528},{"$f":"IF(E8=\"  \",\"  \",(E8*100/totplato))","v":75.54249363009113},{"$f":"IF(O8=0,\"\",E8-(E8*O8/100))","v":1.0058356142941296},"    te verwachten  uit suikers en",null,null,null,{"$f":"IF(D8=0,0,VLOOKUP(A8,'Info-Tabellen'!$H:$K,4,0))","v":100},{"$f":"IF(N8=0,0,(SVGopmout*N8/100)-ATNfactor-Aftrokmaische)","v":91.045454545454547},{"$f":"IF(C8=0,0,C8*0.3748+0.6)","v":1.7244000000000002},{"$f":"D8*C8/Gewenste_liters*effic*10","v":4.73224},null,6,245,244,18,137,null,{"$f":"LOOKUP($Y$2,$S$2:$S$48,U2:U48)","v":204}]
["Munich mout 15",{"$f":"VLOOKUP(A9,'Info-Tabellen'!$H:$J,2,0)","v":80.069999999999993},{"$f":"VLOOKUP(A9,'Info-Tabellen'!$H:$J,3,0)","v":15},{"$f":"(0.255+0.051)/21*Gewenste_liters","v":0.14571428571428571},{"$f":"IF(Gewenste_liters=0,\"0\",IF(D9=0,\"  \",(B9*D9/(Gewenste_liters+hopverlies))*effic))","v":0.77303002159827217},2.5198794972617482,5.4972693302673177,5.1988132086199812,6.9221324661299821E-2," â   extracten   â",null,null,null,{"$f":"IF(D9=0,0,VLOOKUP(A9,'Info-Tabellen'!$H:$K,4,0))","v":100},91.045454545454547,{"$f":"IF(C9=0,0,C9*0.3748+0.6)","v":6.2219999999999995},{"$f":"D9*C9/Gewenste_liters*effic*10","v":1.6283571428571431},null,7,238,233,22,135,null,null,null,"Info over de gekozen hopsoorten:   (A) = aroma (B) = Bitter (U) = Universeel"]
["Tarwevlokken",{"$f":"VLOOKUP(A10,'Info-Tabellen'!$H:$J,2,0)","v":73.58},{"$f":"VLOOKUP(A10,'Info-Tabellen'!$H:$J,3,0)","v":4},{"$f":"0.305/21*Gewenste_liters","v":0.14523809523809525},0.70805130648371672,1.0099905332174735,5.4793043978154641,4.7618156885000449,6.340277608058742E-2,{"$f":"SUM($E$19:$E$22)","v":2.1555922585016729},{"$f":"(1+($J$10/(258.6-0.87955*$J$10)))*1000","v":1008.3971883900331},{"$f":"IF(ISNUMBER($J$10),$J$10,\"\")","v":2.1555922585016729},null,{"$f":"IF(D10=0,0,VLOOKUP(A10,'Info-Tabellen'!$H:$K,4,0))","v":100},91.045454545454547,2.0992000000000002,0.43280952380952392,null,8,230,225,24,160,null,"B",null,{"$f":"_hop1","v":"Styrian Golding (A)"}]
["  - - Kies mout of graan - -",{"$f":"VLOOKUP(A11,'Info-Tabellen'!$H:$J,2,0)","v":0},{"$f":"VLOOKUP(A11,'Info-Tabellen'!$H:$J,3,0)","v":0},null,"  ","  ","  ","  ","",null,"â te verwachten totaal â",null,null,{"$f":"IF(D11=0,0,VLOOKUP(A11,'Info-Tabellen'!$H:$K,4,0))","v":0},0,0,0,null,9,229,214,30,163,null,{"$f":"LOOKUP($Y$2,$S$2:$S$48,V2:V48)","v":32},null,{"$f":"VLOOKUP(_hop1,'Info-Tabellen'!$R:$V,3,0)","v":"Delicaat, iets pikant en grasachtig/bloemig. Zeer populair vanwege karakteristieke aroma en gemiddelde alpha waarden"}]
["  - - Kies mout of graan - -",{"$f":"VLOOKUP(A12,'Info-Tabellen'!$H:$J,2,0)","v":0},{"$f":"VLOOKUP(A12,'Info-Tabellen'!$H:$J,3,0)","v":0},null,"  ","  ","  ","  ","",{"$f":"IF(ISNUMBER(totplato),totplato,\"\")","v":14.869355573624699},{"$f":"(1+(totplato/(258.6-0.87955*totplato)))*1000","v":1060.5622969324361},{"$f":"IF(ISNUMBER($J$12),$L$7+$L$10,\"\")","v":15.314337289654002},null,{"$f":"IF(D12=0,0,VLOOKUP(A12,'Info-Tabellen'!$H:$K,4,0))","v":0},0,0,0,null,10,224,204,32,165]
["  - - Kies mout of graan - -",{"$f":"VLOOKUP(A13,'Info-Tabellen'!$H:$J,2,0)","v":0},{"$f":"VLOOKUP(A13,'Info-Tabellen'!$H:$J,3,0)","v":0},null,"  ","  ","  ","  ","",null,"â voorspelling eind SG",null,null,{"$f":"IF(D13=0,0,VLOOKUP(A13,'Info-Tabellen'!$H:$K,4,0))","v":0},0,0,0,null,11,218,196,41,168,null,"A"]
["  - - Kies mout of graan - -",{"$f":"VLOOKUP(A14,'Info-Tabellen'!$H:$J,2,0)","v":0},{"$f":"VLOOKUP(A14,'Info-Tabellen'!$H:$J,3,0)","v":0},null,"  ","  ","  ","  ","",{"$f":"voorsp_eindplato","v":0.97679029564839137},{"$f":"voorsp_eindSG","v":1003.2819339085073}," - - - - ",null,{"$f":"IF(D14=0,0,VLOOKUP(A14,'Info-Tabellen'!$H:$K,4,0))","v":0},0,0,0,null,12,212,184,39,170,null,{"$f":"LOOKUP($Y$2,$S$2:$S$48,W2:W48)","v":165},null,{"$f":"_hop2","v":"Styrian Golding (A)"}]
["  - - Kies mout of graan - -",{"$f":"VLOOKUP(A15,'Info-Tabellen'!$H:$J,2,0)","v":0},{"$f":"VLOOKUP(A15,'Info-Tabellen'!$H:$J,3,0)","v":0},null,"  ","  ","  ","  ","",{"$f":"SUM(I8:I18)","v":1.1384597150360167},"<Gr FG Skr>",{"$f":"SUM(I19:I23)","v":-0.16166941938762536},null,{"$f":"IF(D15=0,0,VLOOKUP(A15,'Info-Tabellen'!$H:$K,4,0))","v":0},0,0,0,null,13,208,176,46,173,null,null,null,{"$f":"VLOOKUP(_hop2,'Info-Tabellen'!$R:$V,3,0)","v":"Delicaat, iets pikant en grasachtig/bloemig. Zeer populair vanwege karakteristieke aroma en gemiddelde alpha waarden"}]
{"$rows_left_out":76}
{"sheet":"Info-Tabellen","index":1,"n_rows":151,"n_cols":33,"rows_kept":151,"cut":false,"hidden":false,"merged":[]}
["Info: Eigenschappen van gekende bieren.",null,null,null,null,null,null,"Mouten en granen.",null,null,null,null,"Suikers & extracten",null,null,null,null,"Hop",null,null,null,null,null,"Gisten gegevens",null,null,null,null,null,null,"Brouwzouten, Kruiden, Specerijen en extra additieven"]
["Naam","Stam-wort (°Pt)","Stam-wort (SG)","Alc. Vol %","EBC kleur","IBU (EBU)",null,"Naam                                           De kolom \"vergistbaarheid\" is t.o.v.  Pilsmout = 100","% Op-brengst","± Kleur EBC","Vergist ings correc- tie",null,"Naam                                      De kolom \"vergistbaarheid\" is t.o.v. kristalsuiker = 100","% Op-brengst","± Kleur EBC","Vergist-baar-heid(*)",null,"Benaming","Gem. Alfa zuur %","Eigenschappen","Vervangers","Biertype",null,"Naam","SVG op Mout","SVG op Suiker","Advies °C vergis ting","Eigenschappen: de hier vermelde vergistngspercentages zijn benaderingen en niet aan de praktijk getoetst.",null,null,"Naam","unit","advies"]
["Affligem blond",16,{"$f":"IF(ISNUMBER(B3),(1+(B3/(258.6-0.87955*B3)))*1000,\"\")","v":1065.432393615107},6.8,14,24,null,"  - - Kies mout of graan - -",null,null,null,null," - - Kies suiker of extract - -",null,null,null,null," - - Kies hop - -",null,null,null,null,null,"1) KORRELGISTEN",null,null,null,null,null,null," - - Kies additief - -","-","-"]
["Affligem Tripel",18.399999999999999,{"$f":"IF(ISNUMBER(B4),(1+(B4/(258.6-0.87955*B4)))*1000,\"\")","v":1075.902493017383},8.3000000000000007,13,31,null,"Pilsmout 3",80.069999999999993,3,100,null,"Basterdsuiker",99.5,0.1,100,null,"Admiral (B)",14,"Typisch Engels aroma, universele hop. Goede vervanger voor zowel hoge alpha hop als universele hop bij het koken.","Target, Northdown, Challenger","Engelse Ale",null,"Brewferm Blanche korrel",75,107.5,20,"Witbier, banaan/kruidnagelAromas, Hoger eindSG","k",null,"Anijszaad","g ","soms bij Wittekes, Max 1g per 25 liter geplet, einde koken"]
["Grimbergen dubbel",14.5,1058.9798859267992,6.4,18,31,null,"Tarwemout",83.5,2.7,100,null,"Bruine (basterd)suiker",99.55,30,99.5,null,"Amarillo (U)",10,"Citrus, bloemig.","Cascade, Centennial","American ale, IPA.",null,"Brewferm Lager korrel",72,107,20,"Cleane smaak, niet zwavelig, medium eindSG","k",null,"Ascorbinezuur","g ","(Ascorvit,Vit.C) voorkomt oxidatie, dosis 1g/ 30 liter beslag"]
["Leffe Blond",15.6,1063.7049266205001,6.6,15,25,null,"Brewferm Whisky mout",75,4,100,null,"Bruine kandijsuiker",99.55,10.005021607606587,100,null,"Bramling Cross (A)",6.4,"Mild, fruitig aroma met iets van citrus/limoen. Heel licht zurig.","(East) Kent Golding, WGV, evt Fuggles","Engelse Ale, Scotch",null,"Brewferm Top",68,107,20,"Geeftt fruitige esters.Hoger eindSG","k",null,"Biersol","ml","Kiezelsol om trub beter neer te slaan 3ml/10liter direct na koken"]
["Maredsous 8",16.899999999999999,1069.3374281529364,8.1,65,29,null,"Palemout 7 ",80.069999999999993,8,100,null,"Candico donkere stroop",68,100,93,null,"Brewers Gold (A)",6,"Fruitig, zwarte bes, pittig. Universele bitterhop. Heeft een wat hardere bitterheid.","Northdown, Northern brewer","Lambiek, Duitse pils",null,"Danstar Abbaye",77,107.5,21,"Nogal phenolisch, minder geslaagd.","k",null,"Calciumchloride","g ","CaCl2 Geeft zachte en volmondigere smaak Max.0,2g/lit. Verlaagt pH."]
["Sint-Bernardus 12",21.5,1089.6993164181979,10,78,22,null,"Munich mout 15",80.069999999999993,15,100,null,"Dextrosepoeder (Glucose)",92.3,0.1,100,null,"Cascade PELL Brouwland (A)",7,"Medium sterk aroma. Amerika´s meest populaire aromahop. Heeft een kenmerkend citrus- tot grapefruitkarakter.","Centennial, Amarillo","IPA, Am.Ale, witbier",null,"Danstar Belle Saison",91,107.5,"22...30","Belgische Saisongist","k",null,"Calciumsulfaat","g ","CaSO4 Verlaagt pH, verhoogt hopbitter, dosis zie verpakking"]
["St-Feuillin Tripel",18,1074.1448320434192,8.5,14,28,null,"Tarwemout donker",80,31.005141973052183,99.5,null,"Glucosestroop 28 D.E.",69,1,23,null,"Cascade BLM (A)",7.5,"Medium sterk aroma. Amerika´s meest populaire aromahop. Heeft een kenmerkend citrus- tot grapefruitkarakter.","Centennial, Amarillo","IPA, Am.Ale, witbier",null,"Danstar BRY-97 IPA ",82,107.5,"17...20","Voor o.a. IPA's, licht esterachtig, vrijwel neutraal en geeft geen onaangename geuren.","k",null,"Carafa of \"Réglise\"","g ","(Zoethoutdrop) Schuimverbeteraar, 1,5g / 10L tijdens koken"]
["Tripel Karmeliet",19.5,1080.7624722883766,8,12,20,null,"Aromamout (Amber 50)",80.069999999999993,49.057338814674104,99.5,null,"Glucosestroop 50 D.E.",69,1,70,null,"Centennial (U)",9.5,"Medium intens met bloemige en citrusachtige trekjes","Cascade","Am. Ale, Am. Witbier",null,"Danstar CBC-1 BottleYeast",75,107.5,"13…20","Speciale Bottelgist, flinke sedimentatie.","k",null,"Cardemom","pit","bij Wittekes, Binnenste van 1 gepelde pit per 20 liter einde koken"]
["Chimay Rood",14.9,1060.6937734156018,7.1,30,20,null,"Biscuit mout 50",70,58,99.5,null,"Glucosestroop 55 D.E.",69,1,87,null,"Challenger (U)",6,"Mild tot matig intens, behoorlijk pittig. Een alternatief voor East Kent Golding, maar iets bitterder.","(Hallertauer) Perle, Northern Brewer","Eng.ale, stout, bitters.",null,"Danstar Diamond Lager",78,107.5,11,"Lagerbier Weihenstephan stam","k",null,"Curaçaoschil/bitter","g ","geeft sterk  sinaas aroma + bitter tot 1g / 10 liter"]
["Chimay Wit",16.899999999999999,1069.3374281529364,8.1999999999999993,17,35,null,"CaraPils 5",77,5,98,null,"Glucosestroop 63 D.E.",69,1,76,null,"Citra (U)",13,"Zeer fruitig, perzik, abrikoos, passievrucht, grapefruit, limoen, meloen, kruisbes, lychee, ananas, mango, papaya en andere tropische vruchten smaken en aroma's","Simcoe, en andere fruitige citrus „C” hop","Licht & amber gekleurde bieren. American pal ale, IPA, double IPA",null,"Danstar Munich Weizen",78,107.5,20,"Zwavelig: Weizen en Chimay achtig","k",null,"Fosforzuur 85%","ml","Voor aanzuren beslag, spoelwater en gekookt wort."]
["Chimay Blauw",18.7,1077.224090455592,9,80,35,null,"CaraPils (Cara 20)",76,22,97,null,"Glucosestroop 95 D.E.",69,1,97,null,"EastKent Golding (A)",5,"De fijnste aromahop met engels karakter","First Gold, ev. Fuggles.","Eng. En Belg. Ale",null,"Danstar Nottingham Ale",77,107.5,20,"Zuivere Gist, medium eindSG, heeft Rochefort trekjes.","k",null,"Gagel, gedroogd","g ","Natuurlijk bittermiddel dosis=? Gebruik best samen met hop."]
["Orval",13.6,1055.1415166479537,6.2,25,33,null,"CaraBelge 35 (Brouwland)",76,35,95,null,"Honing dik",81,2,90,null,"First Gold (U)",7.5,"Uitgebalanceerde bitterheid, fruitig, iets pikant. Een beetje als Kent Golding (zacht, aangenaam, geurig) maar wat pittiger.","(East) Kent Gold, ev Fuggles.","Eng. En Belg. Ale",null,"Danstar Windsor Ale",68,107,20,"Zuivere Neutrale gist, hoger eind SG goede bottelgist","k",null,"gedroogde citroenschil","g ","geeft citrusaroma tot 1g / 10 liter"]
["Rochefort 6",7.5,1029.7615061703043,7.8,40,18,null,"CaraVienne (Cara 50)",76,66,95,null,"Honing vloeibaar",79,1.5,90,null,"Fuggles (A)",3,"Mild en aangenaam, gronderig, fruitig. Typisch Engelse hopsmaak. Geeft bier een rond en vol karakter.","Styrian Golding, Tettnanger, Willamette","Alle bieren.",null,"Danstar Reserve",null,null,null,null,"k",null,"gedroogde sinaasschil","g ","geeft aangenaam aroma Ongeveer 2g / 10 liter"]
{"$rows_left_out":137}
{"sheet":"Origineel recept","index":2,"n_rows":89,"n_cols":31,"rows_kept":89,"cut":false,"hidden":false,"merged":[[0,0,0,1],[0,10,0,11],[1,0,1,1],[1,10,1,11],[1,26,2,27],[2,3,2,5],[2,6,2,11],[27,4,27,5],[29,6,29,11],[4,26,5,27],[7,9,7,11],[8,9,8,11],[10,26,11,27],[14,26,15,27],[16,9,16,11],[34,6,34,8],[34,26,34,27],[18,26,19,27],[18,34,18,35],[22,26,23,27],[26,26,27,27],[30,6,30,8],[30,26,31,27],[31,6,31,8],[33,6,33,8],[33,26,33,27],[41,6,41,8],[41,26,41,27],[35,6,35,8],[35,26,35,27],[36,6,36,8],[36,26,36,27],[37,6,37,8],[37,26,37,27],[38,6,38,8],[38,26,38,27],[39,6,39,8],[39,26,39,27],[40,6,40,8],[40,26,40,27],[42,3,42,4],[42,6,42,8],[42,26,42,27],[53,1,53,2],[55,4,55,5],[43,9,43,11],[71,1,71,11],[44,5,44,6],[46,4,46,5],[46,6,46,7],[47,10,47,11],[49,7,49,9],[52,10,52,11]]}
["Saison",null," < Naam Bier",null,null,"Beslagdikte in L/kg >  ",3.6,{"$f":"IF(mashfactor>4.5,0,(5-mashfactor)/2.2)","v":0.63636363636363624},null,"Brouwdatum >",null,null,null,null,null,null,null,null,"EBC","R","G","B","A",null,"EBC",null,"Info over de gekozen gist:     Naam >",{"$f":"HoofdGist","v":"Danstar Belle Saison"}]
["http://www.hobbybrouwen.nl/forum/index.php/topic,12765.msg164212.html#msg164212",null,"< Type bier",null,null,"\"Extract Efficiëntie\" >",0.77,null,null,"Botteldatum  >",null,null,null,null,null,null,null,null,0,255,255,255,0,null,{"$f":"$F$26","v":12.419491158027828},null,{"$f":"G3","v":"Belgische Saisongist"}]
["Gewenste liters bier >",21,"Gist >>","Danstar Belle Saison",null,null,{"$f":"VLOOKUP(HoofdGist,'Info-Tabellen'!$X:$AC,5,0)","v":"Belgische Saisongist"},null,null,null,null,null,null,null,null,null,null,null,1,247,249,180,45]
["Vast verlies installatie >",1,null,null,null," ketelinvloed (vaste parameter) > ",99.5,null,null,"Totale kooktijd >",70,{"$f":"IF(Aardbier=\"D\",-0.5,IF(Aardbier=\"M\",-0.3,IF(Aardbier=1,-0.8,2.5)))","v":-0.5},null,null,null,null,null,null,2,245,248,146,61,null,"R",null,"Info over de bottelgist:          Naam >",{"$f":"K53","v":"FermentisSafbrew F2"}]
["Kies een Maischprofiel >","D",null,"eiwitrust J/N ? >","N",null,"% verkoken/uur>",19,{"$f":"VLOOKUP(HoofdGist,'Info-Tabellen'!$X:$AB,2,0)","v":91},{"$f":"SUM($D$8:$D$18)","v":4.5184999999999995},{"$f":"IF(Eiwitrust=\"J\",10,0)","v":0},{"$f":"(totplato-VSPrestextract)/(2.0665-0.010665*(totplato))","v":4.8174477538147062},null,null,null,null,null,null,3,248,249,114,75,null,{"$f":"LOOKUP($Y$2,$S$2:$S$48,T2:T48)","v":212},null,{"$f":"VLOOKUP(bottelgist,'Info-Tabellen'!$X:$AB,5,0)","v":"Speciale Bottelgist, flinke sedimentatie."}]
["Geef opslagtemperatuur mout > ",14,null,null,null,"na beslagcorrectie op Extract Effic.>",{"$f":"IF(mashfactor<3.66,$G$2-((mashfactor)/1000)+0.00666,$G$2-((mashfactor)/20)+0.175)","v":0.77305999999999997},null,{"$f":"IF(moutkilos=0,\"\",IF(Aardbier=1,moutkilos*1.6*($B$30-mouttemp)/(mashwater*4.18),moutkilos*1.6*($B$29-mouttemp)/(mashwater*4.18)))","v":5.0035963348656853},null,"â te verwachten na koken â",null,null,null,{"$f":"VLOOKUP(HoofdGist,'Info-Tabellen'!$X:$AB,3,0)","v":107.5},"ter info",null,null,4,248,247,83,90,null,null,null,null,null,null,null,123456789]
["Grondstoffen","Opbrengst","EBC-kleur","kg â","°PLATO","EBC","%Gew.","%Stort","FG",{"$f":"SUM($E$8:$E$18)","v":12.525654232169988},{"$f":"(1+($J$7/(258.6-0.87955*$J$7)))*1000","v":1050.5917254220865},{"$f":"IF(ISNUMBER($J$7),$J$7*1.035,\"\")","v":12.964052130295936},null,"gist factor","SVG","LoviBond","EBC",null,5,245,248,48,121,null,"G"]
["Pilsmout 3",{"$f":"VLOOKUP(A8,'Info-Tabellen'!$H:$K,2,0)","v":80.069999999999993},{"$f":"VLOOKUP(A8,'Info-Tabellen'!$H:$K,3,0)","v":3},{"$f":"3/16*21","v":3.9375},{"$f":"IF(Gewenste_liters=0,\"0\",IF(D8=0,\"  \",(B8*D8/(Gewenste_liters+hopverlies))*effic))","v":10.891365388439539},{"$f":"IF(Gewenste_liters=0,\"0\",IF(D8=0,\"  \",1.8*(Q8)^0.69))","v":4.9627701141832476},{"$f":"IF(D8=\"\",\"  \",(D8*100/Totaalkg))","v":87.141750580945015},{"$f":"IF(E8=\"  \",\"  \",(E8*100/totplato))","v":86.952467205001895},{"$f":"IF(O8=0,\"\",E8-(E8*O8/100))","v":0.99507474685288599},"    te verwachten  uit suikers en",null,null,null,{"$f":"IF(D8=0,0,VLOOKUP(A8,'Info-Tabellen'!$H:$K,4,0))","v":100},{"$f":"IF(N8=0,0,(SVGopmout*N8/100)-ATNfactor-Aftrokmaische)","v":90.86363636363636},{"$f":"IF(C8=0,0,C8*0.3748+0.6)","v":1.7244000000000002},{"$f":"D8*C8/Gewenste_liters*effic*10","v":4.3484625000000001},null,6,245,244,18,137,null,{"$f":"LOOKUP($Y$2,$S$2:$S$48,U2:U48)","v":184}]
["Munich mout 15",{"$f":"VLOOKUP(A9,'Info-Tabellen'!$H:$J,2,0)","v":80.069999999999993},{"$f":"VLOOKUP(A9,'Info-Tabellen'!$H:$J,3,0)","v":15},{"$f":"0.225/21*Gewenste_liters","v":0.22500000000000001},{"$f":"IF(Gewenste_liters=0,\"0\",IF(D9=0,\"  \",(B9*D9/(Gewenste_liters+hopverlies))*effic))","v":0.6223637364822594},2.090822705130821,4.979528604625429,4.9687124117143942,5.6861414105879193E-2," â   extracten   â",null,null,null,{"$f":"IF(D9=0,0,VLOOKUP(A9,'Info-Tabellen'!$H:$K,4,0))","v":100},90.86363636363636,{"$f":"IF(C9=0,0,C9*0.3748+0.6)","v":6.2219999999999995},{"$f":"D9*C9/Gewenste_liters*effic*10","v":1.2424178571428572},null,7,238,233,22,135,null,null,null,"Info over de gekozen hopsoorten:   (A) = aroma (B) = Bitter (U) = Universeel"]
["Tarwemout",{"$f":"VLOOKUP(A10,'Info-Tabellen'!$H:$J,2,0)","v":83.5},{"$f":"VLOOKUP(A10,'Info-Tabellen'!$H:$J,3,0)","v":2.7},{"$f":"0.305/21*Gewenste_liters","v":0.30499999999999999},0.87978843283582087,0.78998016636327062,6.7500276640478045,7.0238920580789754,8.0380670454545444E-2,{"$f":"SUM($E$19:$E$22)","v":0},{"$f":"(1+($J$10/(258.6-0.87955*$J$10)))*1000","v":1000},{"$f":"IF(ISNUMBER($J$10),$J$10,\"\")","v":0},null,{"$f":"IF(D10=0,0,VLOOKUP(A10,'Info-Tabellen'!$H:$K,4,0))","v":100},90.86363636363636,1.6119600000000003,0.30314995714285714,null,8,230,225,24,160,null,"B",null,{"$f":"_hop1","v":"Styrian Golding (A)"}]
["CaraMunich (Cara 120)",{"$f":"VLOOKUP(A11,'Info-Tabellen'!$H:$J,2,0)","v":75},{"$f":"VLOOKUP(A11,'Info-Tabellen'!$H:$J,3,0)","v":120},{"$f":"0.051/21*Gewenste_liters","v":5.0999999999999997E-2},0.13213667441236929,3.1525848390171545,1.1286931503817639,1.0549283252047543,2.6501811917142654E-2,null,"â te verwachten totaal â",null,null,{"$f":"IF(D11=0,0,VLOOKUP(A11,'Info-Tabellen'!$H:$K,4,0))","v":88},79.943636363636358,45.576000000000001,2.2529177142857137,null,9,229,214,30,163,null,{"$f":"LOOKUP($Y$2,$S$2:$S$48,V2:V48)","v":39},null,{"$f":"VLOOKUP(_hop1,'Info-Tabellen'!$R:$V,3,0)","v":"Delicaat, iets pikant en grasachtig/bloemig. Zeer populair vanwege karakteristieke aroma en gemiddelde alpha waarden"}]
["  - - Kies mout of graan - -",{"$f":"VLOOKUP(A12,'Info-Tabellen'!$H:$J,2,0)","v":0},{"$f":"VLOOKUP(A12,'Info-Tabellen'!$H:$J,3,0)","v":0},null,"  ","  ","  ","  ","",{"$f":"IF(ISNUMBER(totplato),totplato,\"\")","v":12.525654232169988},{"$f":"(1+(totplato/(258.6-0.87955*totplato)))*1000","v":1050.5917254220865},{"$f":"IF(ISNUMBER($J$12),$L$7+$L$10,\"\")","v":12.964052130295936},null,{"$f":"IF(D12=0,0,VLOOKUP(A12,'Info-Tabellen'!$H:$K,4,0))","v":0},0,0,0,null,10,224,204,32,165]
["  - - Kies mout of graan - -",{"$f":"VLOOKUP(A13,'Info-Tabellen'!$H:$J,2,0)","v":0},{"$f":"VLOOKUP(A13,'Info-Tabellen'!$H:$J,3,0)","v":0},null,"  ","  ","  ","  ","",null,"â voorspelling eind SG",null,null,{"$f":"IF(D13=0,0,VLOOKUP(A13,'Info-Tabellen'!$H:$K,4,0))","v":0},0,0,0,null,11,218,196,41,168,null,"A"]
["  - - Kies mout of graan - -",{"$f":"VLOOKUP(A14,'Info-Tabellen'!$H:$J,2,0)","v":0},{"$f":"VLOOKUP(A14,'Info-Tabellen'!$H:$J,3,0)","v":0},null,"  ","  ","  ","  ","",{"$f":"voorsp_eindplato","v":1.1588186433304533},{"$f":"voorsp_eindSG","v":1003.9898659740101}," - - - - ",null,{"$f":"IF(D14=0,0,VLOOKUP(A14,'Info-Tabellen'!$H:$K,4,0))","v":0},0,0,0,null,12,212,184,39,170,null,{"$f":"LOOKUP($Y$2,$S$2:$S$48,W2:W48)","v":170},null,{"$f":"_hop2","v":"Styrian Golding (A)"}]
["  - - Kies mout of graan - -",{"$f":"VLOOKUP(A15,'Info-Tabellen'!$H:$J,2,0)","v":0},{"$f":"VLOOKUP(A15,'Info-Tabellen'!$H:$J,3,0)","v":0},null,"  ","  ","  ","  ","",{"$f":"SUM(I8:I18)","v":1.1588186433304533},"<Gr FG Skr>",{"$f":"SUM(I19:I23)","v":0},null,{"$f":"IF(D15=0,0,VLOOKUP(A15,'Info-Tabellen'!$H:$K,4,0))","v":0},0,0,0,null,13,208,176,46,173,null,null,null,{"$f":"VLOOKUP(_hop2,'Info-Tabellen'!$R:$V,3,0)","v":"Delicaat, iets pikant en grasachtig/bloemig. Zeer populair vanwege karakteristieke aroma en gemiddelde alpha waarden"}]
{"$rows_left_out":74}